{"text_format":"1","workbook":"xlsx","n_sheets":6,"sheets":["Questionnaire","Results","Background Rankings - Hide","Messages - Hide","Drop-Down Data - Hide","Methodology"],"not_rendered":{"charts":0,"images":1,"macros":1,"external_links":0,"defined_names":9,"comments":0,"pivot_tables":0},"unopened":[],"bounds":{"document_bytes":16777216,"sheet_cells":100000,"rows_first":2000,"rows_last":500,"rows_between":2000,"halvings":0,"cell_chars":16384,"cell_head_chars":4096},"cells_cut":0,"cells_raw":0,"read":"whole","date_system":"1900"}

{"sheet":"Questionnaire","index":0,"n_rows":32,"n_cols":7,"rows_kept":32,"cut":false,"hidden":false,"merged":[[2,2,4,2],[2,5,4,8],[5,5,5,6],[1,1,1,2],[5,1,5,2]]}
[]
[null,"Introduction"]
[null,null,"Purpose: This tool is designed to accompany the Food Loss and Waste Accounting and Reporting Standard (FLW Standard). It provides suggested methods for quantifying food loss and waste (FLW). \n\nInstructions: Answer all the questions below to the best of your ability by using the drop-down menus, then press the \"Get results\" button. This will take you to the Results Tab which ranks all the methods included in the FLW Standard (see Chapter 7).  You may need to click \"Enable macros\" when prompted by Excel in order to use this sheet. ",null,null,"Note: \n• The \"Methodology Tab\" explains how this ranking of methods was developed. \n• The recommendations provided do not take into account the availability of resources (e.g., budget, staff time). The tool does not consider which methods would work well in combination (see \"Methodology Tab\" for additional details).\n• We welcome your questions and suggestions. Please contact Brian Lipinski at BLipinski@wri.org."]
[]
[]
[null,"Questions",null,null,null,"Please select answers from drop-down menus"]
{"$rows_left_out":27}
{"sheet":"Results","index":1,"n_rows":16,"n_cols":25,"rows_kept":16,"cut":false,"hidden":false,"merged":[[3,15,3,16],[1,15,1,16]]}
[]
[null,null,null,null,null,null,null,null,null,null,null,null,null,null,null,"Methods in green are recommended for further consideration, based on the responses given in the questionnaire. Those in orange may be appropriate in certain situations and those in red are not recommended. Further guidance in the FLW Standard can help you decide which method (or combination of methods) is appropriate. The scores in column R are out of 100 (see \"Methodology Tab\" for details). \nIf any words appear \"cut off\" in the table below, set the Zoom feature back to 100%.",null,null,"The comments include information on why a method is recommended or not for a given context. A user may revise its answers to the questions in light of these comments. Some considerations, such as budget and staff time, have not been accounted for in this tool. Therefore, the recommendations are based on the assumption that the required resources are available."]
[]
[null,"M1","M2","M3","M4","M5","M6","M7","M8","M9","M10","M11",null,null,"        Methods & Description","Methods & Description",null,"Score","Comments",null,"When this method is good","Why this method is not ideal","Why it's been rejected. ","If reasons needed"]
["Q1",{"$f":"INDEX('Background Rankings - Hide'!C4:C6,MATCH(Questionnaire!$F8,'Background Rankings - Hide'!$B4:$B6,0))","v":{"$error":"#N/A"}},{"$f":"INDEX('Background Rankings - Hide'!D4:D6,MATCH(Questionnaire!$F8,'Background Rankings - Hide'!$B4:$B6,0))","v":{"$error":"#N/A"}},{"$f":"INDEX('Background Rankings - Hide'!E4:E6,MATCH(Questionnaire!$F8,'Background Rankings - Hide'!$B4:$B6,0))","v":{"$error":"#N/A"}},{"$f":"INDEX('Background Rankings - Hide'!F4:F6,MATCH(Questionnaire!$F8,'Background Rankings - Hide'!$B4:$B6,0))","v":{"$error":"#N/A"}},{"$f":"INDEX('Background Rankings - Hide'!G4:G6,MATCH(Questionnaire!$F8,'Background Rankings - Hide'!$B4:$B6,0))","v":{"$error":"#N/A"}},{"$f":"INDEX('Background Rankings - Hide'!H4:H6,MATCH(Questionnaire!$F8,'Background Rankings - Hide'!$B4:$B6,0))","v":{"$error":"#N/A"}},{"$f":"INDEX('Background Rankings - Hide'!I4:I6,MATCH(Questionnaire!$F8,'Background Rankings - Hide'!$B4:$B6,0))","v":{"$error":"#N/A"}},{"$f":"INDEX('Background Rankings - Hide'!J4:J6,MATCH(Questionnaire!$F8,'Background Rankings - Hide'!$B4:$B6,0))","v":{"$error":"#N/A"}},{"$f":"INDEX('Background Rankings - Hide'!K4:K6,MATCH(Questionnaire!$F8,'Background Rankings - Hide'!$B4:$B6,0))","v":{"$error":"#N/A"}},{"$f":"INDEX('Background Rankings - Hide'!L4:L6,MATCH(Questionnaire!$F8,'Background Rankings - Hide'!$B4:$B6,0))","v":{"$error":"#N/A"}},{"$f":"INDEX('Background Rankings - Hide'!M4:M6,MATCH(Questionnaire!$F8,'Background Rankings - Hide'!$B4:$B6,0))","v":{"$error":"#N/A"}},null,null,"M6",{"$f":"\"\n\"&INDEX('Background Rankings - Hide'!$C$1:$M$1,MATCH(O5,'Background Rankings - Hide'!$C$2:$M$2,0))&\"\n\"","v":"\nDiaries\n"},"Maintaining a daily log of FLW and other information",{"$f":"PRODUCT(INDEX($B$5:$M$15,0,MATCH(O5,$B$4:$M$4,0)))*100","v":{"$error":"#N/A"}},{"$f":"CONCATENATE(IF(U5=\"\",\"\",U5),IF(V5=\"\",\"\",V5),IF(W5=\"\",\"\",W5),IF(X5=\"\",\"\",X5))","v":{"$error":"#N/A"}},null,{"$f":"IF(R5>0,INDEX('Messages - Hide'!$C$3:$M$3,MATCH(O5,'Messages - Hide'!$C$2:$M$2,0)),\"\")","v":{"$error":"#N/A"}},{"$f":"IF(R5<100,IF(R5>0,CONCATENATE(IF(INDEX($B$5:$M$5,MATCH(O5,$B$4:$M$4,0))<1,INDEX('Messages - Hide'!$C$6:$M$6,MATCH(O5,'Messages - Hide'!$C$2:$M$2,0)),\"\"),IF(INDEX($B$6:$M$6,MATCH(O5,$B$4:$M$4,0))<1,INDEX('Messages - Hide'!$C$10:$M$10,MATCH(O5,'Messages - Hide'!$C$2:$M$2,0)),\"\"),IF(INDEX($B$7:$M$7,MATCH(O5,$B$4:$M$4,0))<1,INDEX('Messages - Hide'!$C$14:$M$14,MATCH(O5,'Messages - Hide'!$C$2:$M$2,0)),\"\"),IF(INDEX($B$8:$M$8,MATCH(O5,$B$4:$M$4,0))<1,INDEX('Messages - Hide'!$C$18:$M$18,MATCH(O5,'Messages - Hide'!$C$2:$M$2,0)),\"\"),IF(INDEX($B$9:$M$9,MATCH(O5,$B$4:$M$4,0))<1,INDEX('Messages - Hide'!$C$22:$M$22,MATCH(O5,'Messages - Hide'!$C$2:$M$2,0)),\"\"),IF(INDEX($B$10:$M$10,MATCH(O5,$B$4:$M$4,0))<1,INDEX('Messages - Hide'!$C$26:$M$26,MATCH(O5,'Messages - Hide'!$C$2:$M$2,0)),\"\"),IF(INDEX($B$11:$M$11,MATCH(O5,$B$4:$M$4,0))<1,INDEX('Messages - Hide'!$C$30:$M$30,MATCH(O5,'Messages - Hide'!$C$2:$M$2,0)),\"\"),IF(INDEX($B$12:$M$12,MATCH(O5,$B$4:$M$4,0))<1,INDEX('Messages - Hide'!$C$34:$M$34,MATCH(O5,'Messages - Hide'!$C$2:$M$2,0)),\"\"),IF(INDEX($B$13:$M$13,MATCH(O5,$B$4:$M$4,0))<1,INDEX('Messages - Hide'!$C$38:$M$38,MATCH(O5,'Messages - Hide'!$C$2:$M$2,0)),\"\"),IF(INDEX($B$14:$M$14,MATCH(O5,$B$4:$M$4,0))<1,INDEX('Messages - Hide'!$C$42:$M$42,MATCH(O5,'Messages - Hide'!$C$2:$M$2,0)),\"\"),IF(INDEX($B$15:$M$15,MATCH(O5,$B$4:$M$4,0))<1,INDEX('Messages - Hide'!$C$46:$M$46,MATCH(O5,'Messages - Hide'!$C$2:$M$2,0)),\"\"),\"\"),\"\"),\"\")","v":{"$error":"#N/A"}},{"$f":"IF(R5=0,CONCATENATE(IF(INDEX($B$5:$M$5,MATCH(O5,$B$4:$M$4,0))=0,INDEX('Messages - Hide'!$C$7:$M$7,MATCH(O5,'Messages - Hide'!$C$2:$M$2,0)),\"\"),IF(INDEX($B$6:$M$6,MATCH(O5,$B$4:$M$4,0))=0,INDEX('Messages - Hide'!$C$11:$M$11,MATCH(O5,'Messages - Hide'!$C$2:$M$2,0)),\"\"),IF(INDEX($B$7:$M$7,MATCH(O5,$B$4:$M$4,0))=0,INDEX('Messages - Hide'!$C$15:$M$15,MATCH(O5,'Messages - Hide'!$C$2:$M$2,0)),\"\"),IF(INDEX($B$8:$M$8,MATCH(O5,$B$4:$M$4,0))=0,INDEX('Messages - Hide'!$C$19:$M$19,MATCH(O5,'Messages - Hide'!$C$2:$M$2,0)),\"\"),IF(INDEX($B$9:$M$9,MATCH(O5,$B$4:$M$4,0))=0,INDEX('Messages - Hide'!$C$23:$M$23,MATCH(O5,'Messages - Hide'!$C$2:$M$2,0)),\"\"),IF(INDEX($B$10:$M$10,MATCH(O5,$B$4:$M$4,0))=0,INDEX('Messages - Hide'!$C$27:$M$27,MATCH(O5,'Messages - Hide'!$C$2:$M$2,0)),\"\"),IF(INDEX($B$11:$M$11,MATCH(O5,$B$4:$M$4,0))=0,INDEX('Messages - Hide'!$C$31:$M$31,MATCH(O5,'Messages - Hide'!$C$2:$M$2,0)),\"\"),IF(INDEX($B$12:$M$12,MATCH(O5,$B$4:$M$4,0))=0,INDEX('Messages - Hide'!$C$35:$M$35,MATCH(O5,'Messages - Hide'!$C$2:$M$2,0)),\"\"),IF(INDEX($B$13:$M$13,MATCH(O5,$B$4:$M$4,0))=0,INDEX('Messages - Hide'!$C$39:$M$39,MATCH(O5,'Messages - Hide'!$C$2:$M$2,0)),\"\"),IF(INDEX($B$14:$M$14,MATCH(O5,$B$4:$M$4,0))=0,INDEX('Messages - Hide'!$C$43:$M$43,MATCH(O5,'Messages - Hide'!$C$2:$M$2,0)),\"\"),IF(INDEX($B$15:$M$15,MATCH(O5,$B$4:$M$4,0))=0,INDEX('Messages - Hide'!$C$47:$M$47,MATCH(O5,'Messages - Hide'!$C$2:$M$2,0)),\"\"),\"\"),\"\")","v":{"$error":"#N/A"}},{"$f":"IF(AND(Questionnaire!$F$10=\"yes\",Results!O5<>\"M6\",R5>=90),\" Additional methods may be required to gather information on why FLW is generated, e.g., diaries, qualitative interviews, waste prevention audits (e.g. using site visits) or other methods.\",\"\")","v":{"$error":"#N/A"}},"\n"]
["Q2",{"$f":"INDEX('Background Rankings - Hide'!C9:C11,MATCH(Questionnaire!$F10,'Background Rankings - Hide'!$B9:$B11,0))","v":{"$error":"#N/A"}},{"$f":"INDEX('Background Rankings - Hide'!D9:D11,MATCH(Questionnaire!$F10,'Background Rankings - Hide'!$B9:$B11,0))","v":{"$error":"#N/A"}},{"$f":"INDEX('Background Rankings - Hide'!E9:E11,MATCH(Questionnaire!$F10,'Background Rankings - Hide'!$B9:$B11,0))","v":{"$error":"#N/A"}},{"$f":"INDEX('Background Rankings - Hide'!F9:F11,MATCH(Questionnaire!$F10,'Background Rankings - Hide'!$B9:$B11,0))","v":{"$error":"#N/A"}},{"$f":"INDEX('Background Rankings - Hide'!G9:G11,MATCH(Questionnaire!$F10,'Background Rankings - Hide'!$B9:$B11,0))","v":{"$error":"#N/A"}},{"$f":"INDEX('Background Rankings - Hide'!H9:H11,MATCH(Questionnaire!$F10,'Background Rankings - Hide'!$B9:$B11,0))","v":{"$error":"#N/A"}},{"$f":"INDEX('Background Rankings - Hide'!I9:I11,MATCH(Questionnaire!$F10,'Background Rankings - Hide'!$B9:$B11,0))","v":{"$error":"#N/A"}},{"$f":"INDEX('Background Rankings - Hide'!J9:J11,MATCH(Questionnaire!$F10,'Background Rankings - Hide'!$B9:$B11,0))","v":{"$error":"#N/A"}},{"$f":"INDEX('Background Rankings - Hide'!K9:K11,MATCH(Questionnaire!$F10,'Background Rankings - Hide'!$B9:$B11,0))","v":{"$error":"#N/A"}},{"$f":"INDEX('Background Rankings - Hide'!L9:L11,MATCH(Questionnaire!$F10,'Background Rankings - Hide'!$B9:$B11,0))","v":{"$error":"#N/A"}},{"$f":"INDEX('Background Rankings - Hide'!M9:M11,MATCH(Questionnaire!$F10,'Background Rankings - Hide'!$B9:$B11,0))","v":{"$error":"#N/A"}},null,null,"M8",{"$f":"\"\n\"&INDEX('Background Rankings - Hide'!$C$1:$M$1,MATCH(O6,'Background Rankings - Hide'!$C$2:$M$2,0))&\"\n\"","v":"\nMass balance\n"},"Measuring inputs (e.g., ingredients at a factory site, grain going into a silo) and outputs (e.g., products made, grain shipped to market) alongside changes in levels of stock and changes to the weight of food during processing",{"$f":"PRODUCT(INDEX($B$5:$M$15,0,MATCH(O6,$B$4:$M$4,0)))*100","v":{"$error":"#N/A"}},{"$error":"#N/A"},null,{"$f":"IF(R6>0,INDEX('Messages - Hide'!$C$3:$M$3,MATCH(O6,'Messages - Hide'!$C$2:$M$2,0)),\"\")","v":{"$error":"#N/A"}},{"$f":"IF(R6<100,IF(R6>0,CONCATENATE(IF(INDEX($B$5:$M$5,MATCH(O6,$B$4:$M$4,0))<1,INDEX('Messages - Hide'!$C$6:$M$6,MATCH(O6,'Messages - Hide'!$C$2:$M$2,0)),\"\"),IF(INDEX($B$6:$M$6,MATCH(O6,$B$4:$M$4,0))<1,INDEX('Messages - Hide'!$C$10:$M$10,MATCH(O6,'Messages - Hide'!$C$2:$M$2,0)),\"\"),IF(INDEX($B$7:$M$7,MATCH(O6,$B$4:$M$4,0))<1,INDEX('Messages - Hide'!$C$14:$M$14,MATCH(O6,'Messages - Hide'!$C$2:$M$2,0)),\"\"),IF(INDEX($B$8:$M$8,MATCH(O6,$B$4:$M$4,0))<1,INDEX('Messages - Hide'!$C$18:$M$18,MATCH(O6,'Messages - Hide'!$C$2:$M$2,0)),\"\"),IF(INDEX($B$9:$M$9,MATCH(O6,$B$4:$M$4,0))<1,INDEX('Messages - Hide'!$C$22:$M$22,MATCH(O6,'Messages - Hide'!$C$2:$M$2,0)),\"\"),IF(INDEX($B$10:$M$10,MATCH(O6,$B$4:$M$4,0))<1,INDEX('Messages - Hide'!$C$26:$M$26,MATCH(O6,'Messages - Hide'!$C$2:$M$2,0)),\"\"),IF(INDEX($B$11:$M$11,MATCH(O6,$B$4:$M$4,0))<1,INDEX('Messages - Hide'!$C$30:$M$30,MATCH(O6,'Messages - Hide'!$C$2:$M$2,0)),\"\"),IF(INDEX($B$12:$M$12,MATCH(O6,$B$4:$M$4,0))<1,INDEX('Messages - Hide'!$C$34:$M$34,MATCH(O6,'Messages - Hide'!$C$2:$M$2,0)),\"\"),IF(INDEX($B$13:$M$13,MATCH(O6,$B$4:$M$4,0))<1,INDEX('Messages - Hide'!$C$38:$M$38,MATCH(O6,'Messages - Hide'!$C$2:$M$2,0)),\"\"),IF(INDEX($B$14:$M$14,MATCH(O6,$B$4:$M$4,0))<1,INDEX('Messages - Hide'!$C$42:$M$42,MATCH(O6,'Messages - Hide'!$C$2:$M$2,0)),\"\"),IF(INDEX($B$15:$M$15,MATCH(O6,$B$4:$M$4,0))<1,INDEX('Messages - Hide'!$C$46:$M$46,MATCH(O6,'Messages - Hide'!$C$2:$M$2,0)),\"\"),\"\"),\"\"),\"\")","v":{"$error":"#N/A"}},{"$f":"IF(R6=0,CONCATENATE(IF(INDEX($B$5:$M$5,MATCH(O6,$B$4:$M$4,0))=0,INDEX('Messages - Hide'!$C$7:$M$7,MATCH(O6,'Messages - Hide'!$C$2:$M$2,0)),\"\"),IF(INDEX($B$6:$M$6,MATCH(O6,$B$4:$M$4,0))=0,INDEX('Messages - Hide'!$C$11:$M$11,MATCH(O6,'Messages - Hide'!$C$2:$M$2,0)),\"\"),IF(INDEX($B$7:$M$7,MATCH(O6,$B$4:$M$4,0))=0,INDEX('Messages - Hide'!$C$15:$M$15,MATCH(O6,'Messages - Hide'!$C$2:$M$2,0)),\"\"),IF(INDEX($B$8:$M$8,MATCH(O6,$B$4:$M$4,0))=0,INDEX('Messages - Hide'!$C$19:$M$19,MATCH(O6,'Messages - Hide'!$C$2:$M$2,0)),\"\"),IF(INDEX($B$9:$M$9,MATCH(O6,$B$4:$M$4,0))=0,INDEX('Messages - Hide'!$C$23:$M$23,MATCH(O6,'Messages - Hide'!$C$2:$M$2,0)),\"\"),IF(INDEX($B$10:$M$10,MATCH(O6,$B$4:$M$4,0))=0,INDEX('Messages - Hide'!$C$27:$M$27,MATCH(O6,'Messages - Hide'!$C$2:$M$2,0)),\"\"),IF(INDEX($B$11:$M$11,MATCH(O6,$B$4:$M$4,0))=0,INDEX('Messages - Hide'!$C$31:$M$31,MATCH(O6,'Messages - Hide'!$C$2:$M$2,0)),\"\"),IF(INDEX($B$12:$M$12,MATCH(O6,$B$4:$M$4,0))=0,INDEX('Messages - Hide'!$C$35:$M$35,MATCH(O6,'Messages - Hide'!$C$2:$M$2,0)),\"\"),IF(INDEX($B$13:$M$13,MATCH(O6,$B$4:$M$4,0))=0,INDEX('Messages - Hide'!$C$39:$M$39,MATCH(O6,'Messages - Hide'!$C$2:$M$2,0)),\"\"),IF(INDEX($B$14:$M$14,MATCH(O6,$B$4:$M$4,0))=0,INDEX('Messages - Hide'!$C$43:$M$43,MATCH(O6,'Messages - Hide'!$C$2:$M$2,0)),\"\"),IF(INDEX($B$15:$M$15,MATCH(O6,$B$4:$M$4,0))=0,INDEX('Messages - Hide'!$C$47:$M$47,MATCH(O6,'Messages - Hide'!$C$2:$M$2,0)),\"\"),\"\"),\"\")","v":{"$error":"#N/A"}},{"$f":"IF(AND(Questionnaire!$F$10=\"yes\",Results!O6<>\"M6\",R6>=90),\" Additional methods may be required to gather information on why FLW is generated, e.g., diaries, qualitative interviews, waste prevention audits (e.g. using site visits) or other methods.\",\"\")","v":{"$error":"#N/A"}},"\n"]
{"$rows_left_out":11}
{"sheet":"Background Rankings - Hide","index":2,"n_rows":57,"n_cols":13,"rows_kept":57,"cut":false,"hidden":true,"merged":[]}
[null,null,"Records","Direct weighing","Counting","Assessing volume","Waste composition analysis","Diaries","Surveys","Mass balance","Modeling","Proxy data","Assessing volume using COD measurements"]
[null,null,"M1","M2","M3","M4","M5","M6","M7","M8","M9","M10","M11"]
["Q1","How important is it to have a low level of uncertainty (high degree of accuracy in the FLW results)? Note: A higher degree of accuracy is recommended when monitoring targets."]
["A1","Very important (e.g., setting/monitoring targets)",1,1,1,1,1,0.5,0.25,0.9,0.2,0,0.75]
["A2","Moderately important (e.g., seeking general understanding of FLW amounts)",1,1,1,1,1,1,0.5,1,0.85,0.5,1]
["A3","Don't know",1,1,1,1,1,1,1,1,1,1,1]
{"$rows_left_out":52}
{"sheet":"Messages - Hide","index":3,"n_rows":47,"n_cols":13,"rows_kept":47,"cut":false,"hidden":true,"merged":[[28,1,28,11],[32,1,32,11],[20,1,20,11],[8,1,8,11],[12,1,12,11],[16,1,16,11],[24,1,24,11]]}
[null,null,"Records","Direct weighing","Counting","Assessing volume","Waste composition analysis","Diaries","Surveys","Mass balance","Modeling","Proxy data","Assessing volume using COD measurements"]
[null,null,"M1","M2","M3","M4","M5","M6","M7","M8","M9","M10","M11"]
[null,100," This is a good method where records of FLW exist and the user has assess to them. The user needs to understand what has been measured and how it has been measured. It is important that the quality of these records is sufficiently high. ","This is a good method for FLW that is separated from other materials and is in a solid form. If instigating a new quantification based on direct weighing, consideration should be given to how to sample effectively. "," This is a good method where FLW is found in discrete units (e.g., items, bags) and can be quantified by manual counting, with scanning devices, or by using visual scales. If instigating a new quantification based on counting, consideration should be given to how to sample effectively. "," This is a good method for liquid FLW (e.g., drinks, sauces). If instigating a new quantification based on assessing volume, consideration should be given to how to sample effectively. "," This is a good method for solid FLW that is mixed with other materials. Waste compositional analysis can be relatively expensive."," This is a good method where insights are needed about behaviors linked to amounts and types of food. However, FLW data collected through diaries are likely to be less accurate than FLW data collected using weight-based methods. This is because quantities are most frequently captured through approximation rather than measurement, and where measurement is used, it is carried out by non-experts which may lead to inaccuracies. FLW may also be under-reported by diarists. "," This is a good method for gathering data on FLW quantities or other information (e.g., attitudes, beliefs, self-reported behaviors) from a large number of individuals or entities through a set of structured questions."," This is a good method for estimating FLW where inputs and outputs to a process or production site are accurately quantified. Furthermore, knowledge of changes in mass (e.g., evaporation of water during cooking) need to be well understood. "," This is a good method for obtaining an approximate quantification of FLW where relationships between causal factors and FLW are well described. "," This is a good method for obtaining an approximate quantification of FLW where direct measurement of FLW is not possible. It relies on proxies (e.g., data from similar countries / companies) to be available.  "," This is a good method for obtaining an approximate quantification of FLW in liquid waste streams (e.g., material going to the sewer). "]
[]
["Q1",{"$f":"Questionnaire!C8","v":"How important is it to have a low level of uncertainty (high degree of accuracy in the FLW results)? Note: A higher degree of accuracy is recommended when monitoring targets."}]
[null,"<1, >0",null,null,null,null,null," This is not an effective method for monitoring targets, as there are moderate biases in the estimates. "," This is not an effective method for monitoring targets as it is subject to biases."," As the FLW is not being measured directly, mass balance is usually (but not always) less accurate than methods in which FLW is measured. This method may produce highly accurate results if an entity uses very accurate input and output data and also understands well the relationship between the input (e.g., amount of ingredients) required to produce the output (e.g., manufacture of a certain amount of product)."," This is not an effective method for monitoring targets, unless there is an on-going program to understand how the relationships between factors and FLW are changing over time. "," This is not an effective method for monitoring targets as information comes from outside the target scope (e.g., another company, another country, another time). "," COD measurements are influenced by other material in the wastewater stream (e.g., cleaning material, soil), which need to be accounted for in the associated calculations. "]
{"$rows_left_out":42}
{"sheet":"Drop-Down Data - Hide","index":4,"n_rows":27,"n_cols":2,"rows_kept":27,"cut":false,"hidden":true,"merged":[[24,1,26,1],[2,1,4,1],[6,1,8,1],[10,1,12,1],[14,1,17,1],[19,1,22,1]]}
["Drop-Down Options","Relevant Question"]
[]
["Very important (e.g., setting/monitoring targets)","Q1"]
["Moderately important (e.g., seeking general understanding of FLW amounts)"]
["Don't know"]
[]
{"$rows_left_out":22}
{"sheet":"Methodology","index":5,"n_rows":30,"n_cols":2,"rows_kept":30,"cut":false,"hidden":false,"merged":[]}
[]
[null,"How the “FLW Quantification Method Ranking Tool” works"]
[]
[null,"This tool is designed to help an entity select the quantification methods that may be more or less appropriate under different scenarios. It helps guide users’ decisions regarding the most appropriate methods, based on a set of questions about the circumstances under which the entity is quantifying FLW. These circumstances include important criteria such as the desired level of accuracy and ability to get access to the physical FLW being quantified. "]
[]
[null,"In many cases, more than one method may be required to fully meet an entity’s needs (e.g., if FLW is present in different waste streams, and if an entity is seeking to gather information about the causes of FLW, a different method may be needed for each stream). A limitation of the tool is that it does not consider which methods would work well in combination. This means that the tool may be less helpful when selecting methods to quantify FLW across different sectors or for an entire supply chain. In such cases, the entity should seek advice from experts across a range of FLW quantification methodologies before deciding on the most appropriate quantification methods."]
{"$rows_left_out":24}